Windows 7 Forums
Welcome to Windows 7 Forums. Our forum is dedicated to helping you find support and solutions for any problems regarding your Windows 7 PC be it Dell, HP, Acer, Asus or a custom build. We also provide an extensive Windows 7 tutorial section that covers a wide range of tips and tricks.



Windows 7: bsod win7 32bit dell vistro1500 FREQUENT CRASHES

22 May 2011   #1

Windows 7 Ultimate 32bit
 
 
bsod win7 32bit dell vistro1500 FREQUENT CRASHES

Hi there,
i updated to Windows 7 and have been increasingly getting bsod, the machine reboots fine but its quite frequent and becoming a real problem.
any help to eliminate this problem would be appreciated,
thanks,
john
dell vistro1500
Windows 7 ultimate 32
retail version (not supplied with laptop)
4gb ram
centrino processor

My System SpecsSystem Spec
.

22 May 2011   #2

Microsoft Community Contributor Award Recipient

Windows 7 Home Premium 64bit
 
 

Run a system file check - SFC /SCANNOW Command - System File Checker

Code:
netw5v32.sys Thu Mar 26 12:10:37 2009 (49CBA8FD)
Update your Intel WiFi drivers - http://downloadcenter.intel.com/Deta...20Applications

Enable driver verifier - Driver Verifier - Enable and Disable

Please run these tests and report back the results
1. Memtest86 - Run for 7-8 passes - RAM - Test with Memtest86+
2. Prime95 - Run all three tests for 3-4 hours each or until fail - http://www.sevenforums.com/tutorials...t-prime95.html
3. Hard drive scan usings SeaTools - SeaTools for Windows | Seagate - Both long and short tests

BSOD BUGCHECK SUMMARY
Code:

Built by: 7601.17592.x86fre.win7sp1_gdr.110408-1631
Debug session time: Sun May 22 11:09:18.086 2011 (UTC - 4:00)
System Uptime: 0 days 2:51:01.093
Probably caused by : memory_corruption ( nt!MiReleaseConfirmedPageFileSpace+89 )
BUGCHECK_STR:  0xA
PROCESS_NAME:  System
FAILURE_BUCKET_ID:  0xA_nt!MiReleaseConfirmedPageFileSpace+89
BiosReleaseDate = 04/21/2008
SystemManufacturer = Dell Inc.
SystemProductName = Vostro 1500                     
CPUID:        "Intel(R) Core(TM)2 Duo CPU     T5270  @ 1.40GHz"
MaxSpeed:     1400
CurrentSpeed: 1396
ииииииииииииииииииииииииииииииииииииииииииииииииииииииииииииииииииииииииииииииииииииии``
Built by: 7601.17592.x86fre.win7sp1_gdr.110408-1631
Debug session time: Sun May 22 08:17:37.030 2011 (UTC - 4:00)
System Uptime: 0 days 2:12:20.123
*** WARNING: Unable to verify timestamp for netw5v32.sys
*** ERROR: Module load completed but symbols could not be loaded for netw5v32.sys
Probably caused by : netw5v32.sys ( netw5v32+980a0 )
BUGCHECK_STR:  0x7f_0
PROCESS_NAME:  System
FAILURE_BUCKET_ID:  0x7f_0_netw5v32+980a0
BiosReleaseDate = 04/21/2008
SystemManufacturer = Dell Inc.
SystemProductName = Vostro 1500                     
CPUID:        "Intel(R) Core(TM)2 Duo CPU     T5270  @ 1.40GHz"
MaxSpeed:     1400
CurrentSpeed: 1396
ииииииииииииииииииииииииииииииииииииииииииииииииииииииииииииииииииииииииииииииииииииии``
Built by: 7600.16792.x86fre.win7_gdr.110408-1633
Debug session time: Sat May 21 16:57:28.482 2011 (UTC - 4:00)
System Uptime: 0 days 0:53:46.558
BUGCHECK_STR:  0xBE
PROCESS_NAME:  services.exe
FAILURE_BUCKET_ID:  0xBE_nt!KiTrap0E+dc
BiosReleaseDate = 04/21/2008
SystemManufacturer = Dell Inc.
SystemProductName = Vostro 1500                     
CPUID:        "Intel(R) Core(TM)2 Duo CPU     T5270  @ 1.40GHz"
MaxSpeed:     1400
CurrentSpeed: 1396
ииииииииииииииииииииииииииииииииииииииииииииииииииииииииииииииииииииииииииииииииииииии``
Built by: 7600.16792.x86fre.win7_gdr.110408-1633
Debug session time: Sat May 21 16:02:34.983 2011 (UTC - 4:00)
System Uptime: 0 days 6:31:10.059
*** ERROR: Module load completed but symbols could not be loaded for cdd.dll
Probably caused by : cdd.dll ( cdd+3666 )
BUGCHECK_STR:  0xA
PROCESS_NAME:  csrss.exe
FAILURE_BUCKET_ID:  0xA_cdd+3666
BiosReleaseDate = 04/21/2008
SystemManufacturer = Dell Inc.
SystemProductName = Vostro 1500                     
CPUID:        "Intel(R) Core(TM)2 Duo CPU     T5270  @ 1.40GHz"
MaxSpeed:     1400
CurrentSpeed: 1396
ииииииииииииииииииииииииииииииииииииииииииииииииииииииииииииииииииииииииииииииииииииии``
Built by: 7600.16792.x86fre.win7_gdr.110408-1633
Debug session time: Sat May 21 09:30:14.346 2011 (UTC - 4:00)
System Uptime: 0 days 1:12:35.297
*** ERROR: Module load completed but symbols could not be loaded for intelide.sys
*** WARNING: Unable to verify timestamp for amdxata.sys
*** ERROR: Module load completed but symbols could not be loaded for amdxata.sys
*** WARNING: Unable to verify timestamp for ksecpkg.sys
*** ERROR: Module load completed but symbols could not be loaded for ksecpkg.sys
*** WARNING: Unable to verify timestamp for fvevol.sys
*** ERROR: Module load completed but symbols could not be loaded for fvevol.sys
*** WARNING: Unable to verify timestamp for spldr.sys
*** ERROR: Module load completed but symbols could not be loaded for spldr.sys
*** WARNING: Unable to verify timestamp for avgtdix.sys
*** ERROR: Module load completed but symbols could not be loaded for avgtdix.sys
*** WARNING: Unable to verify timestamp for avgmfx86.sys
*** ERROR: Module load completed but symbols could not be loaded for avgmfx86.sys
*** WARNING: Unable to verify timestamp for avgldx86.sys
*** ERROR: Module load completed but symbols could not be loaded for avgldx86.sys
*** WARNING: Unable to verify timestamp for intelppm.sys
*** ERROR: Module load completed but symbols could not be loaded for intelppm.sys
*** WARNING: Unable to verify timestamp for ks.sys
*** ERROR: Module load completed but symbols could not be loaded for ks.sys
*** WARNING: Unable to verify timestamp for drmk.sys
*** ERROR: Module load completed but symbols could not be loaded for drmk.sys
*** WARNING: Unable to verify timestamp for VSTAZL3.SYS
*** ERROR: Module load completed but symbols could not be loaded for VSTAZL3.SYS
*** WARNING: Unable to verify timestamp for btusbflt.sys
*** ERROR: Module load completed but symbols could not be loaded for btusbflt.sys
*** WARNING: Unable to verify timestamp for igdkmd32.sys
*** ERROR: Module load completed but symbols could not be loaded for igdkmd32.sys
*** WARNING: Unable to verify timestamp for netw5v32.sys
*** ERROR: Module load completed but symbols could not be loaded for netw5v32.sys
*** WARNING: Unable to verify timestamp for bcm4sbxp.sys
*** ERROR: Module load completed but symbols could not be loaded for bcm4sbxp.sys
*** WARNING: Unable to verify timestamp for sdbus.sys
*** ERROR: Module load completed but symbols could not be loaded for sdbus.sys
*** WARNING: Unable to verify timestamp for rimmptsk.sys
*** ERROR: Module load completed but symbols could not be loaded for rimmptsk.sys
*** WARNING: Unable to verify timestamp for rimsptsk.sys
*** ERROR: Module load completed but symbols could not be loaded for rimsptsk.sys
*** WARNING: Unable to verify timestamp for rixdptsk.sys
*** ERROR: Module load completed but symbols could not be loaded for rixdptsk.sys
*** WARNING: Unable to verify timestamp for VSTDPV3.SYS
*** ERROR: Module load completed but symbols could not be loaded for VSTDPV3.SYS
*** WARNING: Unable to verify timestamp for VSTCNXT3.SYS
*** ERROR: Module load completed but symbols could not be loaded for VSTCNXT3.SYS
*** WARNING: Unable to verify timestamp for win32k.sys
*** ERROR: Module load completed but symbols could not be loaded for win32k.sys
*** WARNING: Unable to verify timestamp for TSDDD.dll
*** ERROR: Module load completed but symbols could not be loaded for TSDDD.dll
*** WARNING: Unable to verify timestamp for cdd.dll
*** ERROR: Module load completed but symbols could not be loaded for cdd.dll
*** WARNING: Unable to verify timestamp for peauth.sys
*** ERROR: Module load completed but symbols could not be loaded for peauth.sys
*** WARNING: Unable to verify timestamp for secdrv.SYS
*** ERROR: Module load completed but symbols could not be loaded for secdrv.SYS
BUGCHECK_STR:  0xc2_7
PROCESS_NAME:  System
FAILURE_BUCKET_ID:  0xc2_7_nt!ExFreePoolWithTag+1b1
BiosReleaseDate = 04/21/2008
SystemManufacturer = Dell Inc.
SystemProductName = Vostro 1500                     
CPUID:        "Intel(R) Core(TM)2 Duo CPU     T5270  @ 1.40GHz"
MaxSpeed:     1400
CurrentSpeed: 1396
ииииииииииииииииииииииииииииииииииииииииииииииииииииииииииииииииииииииииииииииииииииии``
Built by: 7600.16792.x86fre.win7_gdr.110408-1633
Debug session time: Sat May 21 08:17:13.470 2011 (UTC - 4:00)
System Uptime: 0 days 3:32:40.545
BUGCHECK_STR:  0xBE
PROCESS_NAME:  svchost.exe
FAILURE_BUCKET_ID:  0xBE_nt!KiTrap0E+dc
BiosReleaseDate = 04/21/2008
SystemManufacturer = Dell Inc.
SystemProductName = Vostro 1500                     
CPUID:        "Intel(R) Core(TM)2 Duo CPU     T5270  @ 1.40GHz"
MaxSpeed:     1400
CurrentSpeed: 1396
ииииииииииииииииииииииииииииииииииииииииииииииииииииииииииииииииииииииииииииииииииииии``
Built by: 7600.16792.x86fre.win7_gdr.110408-1633
Debug session time: Fri May 20 17:31:47.650 2011 (UTC - 4:00)
System Uptime: 0 days 4:21:51.725
BUGCHECK_STR:  0xBE
PROCESS_NAME:  svchost.exe
FAILURE_BUCKET_ID:  0xBE_afd!AfdTliIoControl+1dc
BiosReleaseDate = 04/21/2008
SystemManufacturer = Dell Inc.
SystemProductName = Vostro 1500                     
CPUID:        "Intel(R) Core(TM)2 Duo CPU     T5270  @ 1.40GHz"
MaxSpeed:     1400
CurrentSpeed: 1396
ииииииииииииииииииииииииииииииииииииииииииииииииииииииииииииииииииииииииииииииииииииии``
Built by: 7600.16792.x86fre.win7_gdr.110408-1633
Debug session time: Fri May 20 05:59:26.351 2011 (UTC - 4:00)
System Uptime: 0 days 6:30:44.427
BUGCHECK_STR:  0xBE
PROCESS_NAME:  svchost.exe
FAILURE_BUCKET_ID:  0xBE_nt!KiTrap0E+dc
BiosReleaseDate = 04/21/2008
SystemManufacturer = Dell Inc.
SystemProductName = Vostro 1500                     
CPUID:        "Intel(R) Core(TM)2 Duo CPU     T5270  @ 1.40GHz"
MaxSpeed:     1400
CurrentSpeed: 1396
ииииииииииииииииииииииииииииииииииииииииииииииииииииииииииииииииииииииииииииииииииииии``
Built by: 7600.16792.x86fre.win7_gdr.110408-1633
Debug session time: Thu May 19 23:27:48.528 2011 (UTC - 4:00)
System Uptime: 0 days 7:22:25.603
BUGCHECK_STR:  0xBE
PROCESS_NAME:  svchost.exe
FAILURE_BUCKET_ID:  0xBE_ndis!ndisDeviceControlIrpHandler+55b
BiosReleaseDate = 04/21/2008
SystemManufacturer = Dell Inc.
SystemProductName = Vostro 1500                     
CPUID:        "Intel(R) Core(TM)2 Duo CPU     T5270  @ 1.40GHz"
MaxSpeed:     1400
CurrentSpeed: 1396
ииииииииииииииииииииииииииииииииииииииииииииииииииииииииииииииииииииииииииииииииииииии``
Built by: 7600.16792.x86fre.win7_gdr.110408-1633
Debug session time: Thu May 19 14:55:12.941 2011 (UTC - 4:00)
System Uptime: 1 days 1:26:40.921
BUGCHECK_STR:  0x50
PROCESS_NAME:  explorer.exe
FAILURE_BUCKET_ID:  0x50_win32k!Win32AllocPool+13
BiosReleaseDate = 04/21/2008
SystemManufacturer = Dell Inc.
SystemProductName = Vostro 1500                     
CPUID:        "Intel(R) Core(TM)2 Duo CPU     T5270  @ 1.40GHz"
MaxSpeed:     1400
CurrentSpeed: 1396
ииииииииииииииииииииииииииииииииииииииииииииииииииииииииииииииииииииииииииииииииииииии``
Built by: 7600.16695.x86fre.win7_gdr.101026-1503
Debug session time: Wed May 11 06:39:12.763 2011 (UTC - 4:00)
System Uptime: 0 days 6:45:23.839
BUGCHECK_STR:  0xBE
PROCESS_NAME:  svchost.exe
FAILURE_BUCKET_ID:  0xBE_nt!KiTrap0E+dc
BiosReleaseDate = 04/21/2008
SystemManufacturer = Dell Inc.
SystemProductName = Vostro 1500                     
CPUID:        "Intel(R) Core(TM)2 Duo CPU     T5270  @ 1.40GHz"
MaxSpeed:     1400
CurrentSpeed: 1396
ииииииииииииииииииииииииииииииииииииииииииииииииииииииииииииииииииииииииииииииииииииии``
Built by: 7600.16695.x86fre.win7_gdr.101026-1503
Debug session time: Tue May 10 23:52:54.932 2011 (UTC - 4:00)
System Uptime: 0 days 7:46:42.007
BUGCHECK_STR:  0xBE
PROCESS_NAME:  svchost.exe
FAILURE_BUCKET_ID:  0xBE_netbt!NbtQueryWinsSettings+3f
BiosReleaseDate = 04/21/2008
SystemManufacturer = Dell Inc.
SystemProductName = Vostro 1500                     
CPUID:        "Intel(R) Core(TM)2 Duo CPU     T5270  @ 1.40GHz"
MaxSpeed:     1400
CurrentSpeed: 1396
ииииииииииииииииииииииииииииииииииииииииииииииииииииииииииииииииииииииииииииииииииииии``
Built by: 7600.16695.x86fre.win7_gdr.101026-1503
Debug session time: Sat Apr 30 04:41:51.951 2011 (UTC - 4:00)
System Uptime: 0 days 0:52:28.167
BUGCHECK_STR:  0xBE
PROCESS_NAME:  svchost.exe
FAILURE_BUCKET_ID:  0xBE_netbt!NbtQueryWinsSettings+3f
BiosReleaseDate = 04/21/2008
SystemManufacturer = Dell Inc.
SystemProductName = Vostro 1500                     
CPUID:        "Intel(R) Core(TM)2 Duo CPU     T5270  @ 1.40GHz"
MaxSpeed:     1400
CurrentSpeed: 1396
ииииииииииииииииииииииииииииииииииииииииииииииииииииииииииииииииииииииииииииииииииииии``
Built by: 7600.16695.x86fre.win7_gdr.101026-1503
Debug session time: Sat Apr 23 13:21:07.640 2011 (UTC - 4:00)
System Uptime: 0 days 1:49:14.716
Probably caused by : ntkrpamp.exe ( nt!RtlInterlockedSetClearRun+50 )
BUGCHECK_STR:  0xA
PROCESS_NAME:  rundll32.exe
FAILURE_BUCKET_ID:  0xA_nt!RtlInterlockedSetClearRun+50
BiosReleaseDate = 04/21/2008
SystemManufacturer = Dell Inc.
SystemProductName = Vostro 1500                     
CPUID:        "Intel(R) Core(TM)2 Duo CPU     T5270  @ 1.40GHz"
MaxSpeed:     1400
CurrentSpeed: 1396
ииииииииииииииииииииииииииииииииииииииииииииииииииииииииииииииииииииииииииииииииииииии``
Built by: 7600.16695.x86fre.win7_gdr.101026-1503
Debug session time: Fri Apr 15 15:34:14.420 2011 (UTC - 4:00)
System Uptime: 0 days 1:38:34.496
BUGCHECK_STR:  0xBE
PROCESS_NAME:  svchost.exe
FAILURE_BUCKET_ID:  0xBE_netbt!NbtQueryWinsSettings+3f
BiosReleaseDate = 04/21/2008
SystemManufacturer = Dell Inc.
SystemProductName = Vostro 1500                     
CPUID:        "Intel(R) Core(TM)2 Duo CPU     T5270  @ 1.40GHz"
MaxSpeed:     1400
CurrentSpeed: 1396
ииииииииииииииииииииииииииииииииииииииииииииииииииииииииииииииииииииииииииииииииииииии``
Built by: 7600.16695.x86fre.win7_gdr.101026-1503
Debug session time: Fri Apr 15 13:55:11.514 2011 (UTC - 4:00)
System Uptime: 0 days 2:41:33.589
BUGCHECK_STR:  0xBE
PROCESS_NAME:  explorer.exe
FAILURE_BUCKET_ID:  0xBE_nt!KiTrap0E+dc
BiosReleaseDate = 04/21/2008
SystemManufacturer = Dell Inc.
SystemProductName = Vostro 1500                     
CPUID:        "Intel(R) Core(TM)2 Duo CPU     T5270  @ 1.40GHz"
MaxSpeed:     1400
CurrentSpeed: 1396
ииииииииииииииииииииииииииииииииииииииииииииииииииииииииииииииииииииииииииииииииииииии``
Built by: 7600.16695.x86fre.win7_gdr.101026-1503
Debug session time: Fri Apr 15 11:13:10.763 2011 (UTC - 4:00)
System Uptime: 0 days 12:44:10.397
BUGCHECK_STR:  0xBE
PROCESS_NAME:  csrss.exe
FAILURE_BUCKET_ID:  0xBE_dxgkrnl!operator_new+21
BiosReleaseDate = 04/21/2008
SystemManufacturer = Dell Inc.
SystemProductName = Vostro 1500                     
CPUID:        "Intel(R) Core(TM)2 Duo CPU     T5270  @ 1.40GHz"
MaxSpeed:     1400
CurrentSpeed: 1396
ииииииииииииииииииииииииииииииииииииииииииииииииииииииииииииииииииииииииииииииииииииии``
Built by: 7600.16695.x86fre.win7_gdr.101026-1503
Debug session time: Thu Mar 24 17:23:54.607 2011 (UTC - 4:00)
System Uptime: 0 days 2:24:32.683
BUGCHECK_STR:  0xBE
PROCESS_NAME:  wmpnetwk.exe
FAILURE_BUCKET_ID:  0xBE_netbt!NbtQueryWinsSettings+3f
BiosReleaseDate = 04/21/2008
SystemManufacturer = Dell Inc.
SystemProductName = Vostro 1500                     
CPUID:        "Intel(R) Core(TM)2 Duo CPU     T5270  @ 1.40GHz"
MaxSpeed:     1400
CurrentSpeed: 1396
ииииииииииииииииииииииииииииииииииииииииииииииииииииииииииииииииииииииииииииииииииииии``
Built by: 7600.16695.x86fre.win7_gdr.101026-1503
Debug session time: Thu Mar 24 14:58:55.682 2011 (UTC - 4:00)
System Uptime: 0 days 2:02:35.758
BUGCHECK_STR:  0xBE
PROCESS_NAME:  System
FAILURE_BUCKET_ID:  0xBE_CI!MincrypK_UpdateCatalogCache+3fa
BiosReleaseDate = 04/21/2008
SystemManufacturer = Dell Inc.
SystemProductName = Vostro 1500                     
CPUID:        "Intel(R) Core(TM)2 Duo CPU     T5270  @ 1.40GHz"
MaxSpeed:     1400
CurrentSpeed: 1396
ииииииииииииииииииииииииииииииииииииииииииииииииииииииииииииииииииииииииииииииииииииии``
Built by: 7600.16695.x86fre.win7_gdr.101026-1503
Debug session time: Wed Mar 23 16:39:43.170 2011 (UTC - 4:00)
System Uptime: 0 days 1:56:29.964
*** WARNING: Unable to verify timestamp for avgtdix.sys
*** ERROR: Module load completed but symbols could not be loaded for avgtdix.sys
BUGCHECK_STR:  0xBE
PROCESS_NAME:  avgnsx.exe
FAILURE_BUCKET_ID:  0xBE_avgtdix+5786
BiosReleaseDate = 04/21/2008
SystemManufacturer = Dell Inc.
SystemProductName = Vostro 1500                     
CPUID:        "Intel(R) Core(TM)2 Duo CPU     T5270  @ 1.40GHz"
MaxSpeed:     1400
CurrentSpeed: 1396
ииииииииииииииииииииииииииииииииииииииииииииииииииииииииииииииииииииииииииииииииииииии``
Built by: 7600.16695.x86fre.win7_gdr.101026-1503
Debug session time: Tue Mar 22 17:29:24.122 2011 (UTC - 4:00)
System Uptime: 0 days 0:50:38.073
BUGCHECK_STR:  0xBE
PROCESS_NAME:  wmpnetwk.exe
FAILURE_BUCKET_ID:  0xBE_nt!KiTrap0E+dc
BiosReleaseDate = 04/21/2008
SystemManufacturer = Dell Inc.
SystemProductName = Vostro 1500                     
CPUID:        "Intel(R) Core(TM)2 Duo CPU     T5270  @ 1.40GHz"
MaxSpeed:     1400
CurrentSpeed: 1396
ииииииииииииииииииииииииииииииииииииииииииииииииииииииииииииииииииииииииииииииииииииии``
Built by: 7600.16695.x86fre.win7_gdr.101026-1503
Debug session time: Sun Feb 27 11:28:37.646 2011 (UTC - 4:00)
System Uptime: 0 days 0:27:19.597
BUGCHECK_STR:  0xBE
PROCESS_NAME:  svchost.exe
FAILURE_BUCKET_ID:  0xBE_nt!KiTrap0E+dc
BiosReleaseDate = 04/21/2008
SystemManufacturer = Dell Inc.
SystemProductName = Vostro 1500                     
CPUID:        "Intel(R) Core(TM)2 Duo CPU     T5270  @ 1.40GHz"
MaxSpeed:     1400
CurrentSpeed: 1396
ииииииииииииииииииииииииииииииииииииииииииииииииииииииииииииииииииииииииииииииииииииии``
Built by: 7600.16617.x86fre.win7_gdr.100618-1621
Debug session time: Fri Jan 14 15:01:01.046 2011 (UTC - 4:00)
System Uptime: 1 days 15:42:01.275
BUGCHECK_STR:  0x50
PROCESS_NAME:  NclRSSrv.exe
FAILURE_BUCKET_ID:  0x50_nt!MiDeleteVirtualAddresses+194
BiosReleaseDate = 04/21/2008
SystemManufacturer = Dell Inc.
SystemProductName = Vostro 1500                     
CPUID:        "Intel(R) Core(TM)2 Duo CPU     T5270  @ 1.40GHz"
MaxSpeed:     1400
CurrentSpeed: 1396
ииииииииииииииииииииииииииииииииииииииииииииииииииииииииииииииииииииииииииииииииииииии``
Built by: 7600.16617.x86fre.win7_gdr.100618-1621
Debug session time: Thu Dec 23 08:25:30.335 2010 (UTC - 4:00)
System Uptime: 0 days 2:19:36.395
*** WARNING: Unable to verify timestamp for ks.sys
*** ERROR: Module load completed but symbols could not be loaded for ks.sys
Probably caused by : memory_corruption
BUGCHECK_STR:  0x8E
PROCESS_NAME:  audiodg.exe
FAILURE_BUCKET_ID:  MEMORY_CORRUPTION_STRIDE
BiosReleaseDate = 04/21/2008
SystemManufacturer = Dell Inc.
SystemProductName = Vostro 1500                     
CPUID:        "Intel(R) Core(TM)2 Duo CPU     T5270  @ 1.40GHz"
MaxSpeed:     1400
CurrentSpeed: 1396
ииииииииииииииииииииииииииииииииииииииииииииииииииииииииииииииииииииииииииииииииииииии``
Built by: 7600.16617.x86fre.win7_gdr.100618-1621
Debug session time: Fri Dec  3 16:48:03.436 2010 (UTC - 4:00)
System Uptime: 0 days 3:06:20.441
Probably caused by : memory_corruption
PROCESS_NAME:  System
BUGCHECK_STR:  0x7E
FAILURE_BUCKET_ID:  MEMORY_CORRUPTION_STRIDE
BiosReleaseDate = 04/21/2008
SystemManufacturer = Dell Inc.
SystemProductName = Vostro 1500                     
CPUID:        "Intel(R) Core(TM)2 Duo CPU     T5270  @ 1.40GHz"
MaxSpeed:     1400
CurrentSpeed: 1396
ииииииииииииииииииииииииииииииииииииииииииииииииииииииииииииииииииииииииииииииииииииии``
Built by: 7600.16617.x86fre.win7_gdr.100618-1621
Debug session time: Wed Nov 17 16:42:57.955 2010 (UTC - 4:00)
System Uptime: 1 days 1:05:06.078
BUGCHECK_STR:  0x50
PROCESS_NAME:  svchost.exe
FAILURE_BUCKET_ID:  0x50_fileinfo!FIStreamGetNext+45
BiosReleaseDate = 04/21/2008
SystemManufacturer = Dell Inc.
SystemProductName = Vostro 1500                     
CPUID:        "Intel(R) Core(TM)2 Duo CPU     T5270  @ 1.40GHz"
MaxSpeed:     1400
CurrentSpeed: 1396
ииииииииииииииииииииииииииииииииииииииииииииииииииииииииииииииииииииииииииииииииииииии``
Built by: 7600.16617.x86fre.win7_gdr.100618-1621
Debug session time: Fri Oct 29 00:00:14.539 2010 (UTC - 4:00)
System Uptime: 0 days 8:56:55.615
Probably caused by : memory_corruption
BUGCHECK_STR:  0xD1
PROCESS_NAME:  System
FAILURE_BUCKET_ID:  MEMORY_CORRUPTION_STRIDE
BiosReleaseDate = 04/21/2008
SystemManufacturer = Dell Inc.
SystemProductName = Vostro 1500                     
CPUID:        "Intel(R) Core(TM)2 Duo CPU     T5270  @ 1.40GHz"
MaxSpeed:     1400
CurrentSpeed: 1396
ииииииииииииииииииииииииииииииииииииииииииииииииииииииииииииииииииииииииииииииииииииии``
Built by: 7600.16617.x86fre.win7_gdr.100618-1621
Debug session time: Sun Oct 10 20:34:10.005 2010 (UTC - 4:00)
System Uptime: 7 days 13:43:22.423
*** WARNING: Unable to verify timestamp for netw5v32.sys
*** ERROR: Module load completed but symbols could not be loaded for netw5v32.sys
Probably caused by : netw5v32.sys ( netw5v32+f70a6 )
BUGCHECK_STR:  0xD1
PROCESS_NAME:  svchost.exe
FAILURE_BUCKET_ID:  0xD1_netw5v32+f70a6
BiosReleaseDate = 04/21/2008
SystemManufacturer = Dell Inc.
SystemProductName = Vostro 1500                     
CPUID:        "Intel(R) Core(TM)2 Duo CPU     T5270  @ 1.40GHz"
MaxSpeed:     1400
CurrentSpeed: 1396
ииииииииииииииииииииииииииииииииииииииииииииииииииииииииииииииииииииииииииииииииииииии``
Built by: 7600.16617.x86fre.win7_gdr.100618-1621
Debug session time: Thu Sep  9 23:19:43.044 2010 (UTC - 4:00)
System Uptime: 0 days 8:46:39.104
*** WARNING: Unable to verify timestamp for netw5v32.sys
*** ERROR: Module load completed but symbols could not be loaded for netw5v32.sys
Probably caused by : netw5v32.sys ( netw5v32+a38c )
BUGCHECK_STR:  0xD1
PROCESS_NAME:  csrss.exe
FAILURE_BUCKET_ID:  0xD1_netw5v32+a38c
BiosReleaseDate = 04/21/2008
SystemManufacturer = Dell Inc.
SystemProductName = Vostro 1500                     
CPUID:        "Intel(R) Core(TM)2 Duo CPU     T5270  @ 1.40GHz"
MaxSpeed:     1400
CurrentSpeed: 1396
ииииииииииииииииииииииииииииииииииииииииииииииииииииииииииииииииииииииииииииииииииииии``
Built by: 7600.16617.x86fre.win7_gdr.100618-1621
Debug session time: Thu Sep  9 14:32:38.606 2010 (UTC - 4:00)
System Uptime: 0 days 0:47:12.666
BUGCHECK_STR:  0x1a_41284
PROCESS_NAME:  iexplore.exe
FAILURE_BUCKET_ID:  0x1a_41284_nt!MiLocateWsle+c1
BiosReleaseDate = 04/21/2008
SystemManufacturer = Dell Inc.
SystemProductName = Vostro 1500                     
CPUID:        "Intel(R) Core(TM)2 Duo CPU     T5270  @ 1.40GHz"
MaxSpeed:     1400
CurrentSpeed: 1396
ииииииииииииииииииииииииииииииииииииииииииииииииииииииииииииииииииииииииииииииииииииии``
Built by: 7600.16617.x86fre.win7_gdr.100618-1621
Debug session time: Thu Sep  9 13:45:01.046 2010 (UTC - 4:00)
System Uptime: 0 days 1:26:56.106
*** WARNING: Unable to verify timestamp for netw5v32.sys
*** ERROR: Module load completed but symbols could not be loaded for netw5v32.sys
Probably caused by : netw5v32.sys ( netw5v32+a38c )
BUGCHECK_STR:  0xD1
PROCESS_NAME:  System
FAILURE_BUCKET_ID:  0xD1_netw5v32+a38c
BiosReleaseDate = 04/21/2008
SystemManufacturer = Dell Inc.
SystemProductName = Vostro 1500                     
CPUID:        "Intel(R) Core(TM)2 Duo CPU     T5270  @ 1.40GHz"
MaxSpeed:     1400
CurrentSpeed: 1396
ииииииииииииииииииииииииииииииииииииииииииииииииииииииииииииииииииииииииииииииииииииии``
Built by: 7600.16617.x86fre.win7_gdr.100618-1621
Debug session time: Thu Sep  9 12:17:40.047 2010 (UTC - 4:00)
System Uptime: 0 days 12:35:42.107
*** WARNING: Unable to verify timestamp for netw5v32.sys
*** ERROR: Module load completed but symbols could not be loaded for netw5v32.sys
Probably caused by : netw5v32.sys ( netw5v32+909b )
BUGCHECK_STR:  0xD1
PROCESS_NAME:  System
FAILURE_BUCKET_ID:  0xD1_netw5v32+909b
BiosReleaseDate = 04/21/2008
SystemManufacturer = Dell Inc.
SystemProductName = Vostro 1500                     
CPUID:        "Intel(R) Core(TM)2 Duo CPU     T5270  @ 1.40GHz"
MaxSpeed:     1400
CurrentSpeed: 1396
ииииииииииииииииииииииииииииииииииииииииииииииииииииииииииииииииииииииииииииииииииииии``
Built by: 7600.16617.x86fre.win7_gdr.100618-1621
Debug session time: Wed Sep  8 23:41:04.732 2010 (UTC - 4:00)
System Uptime: 0 days 9:07:28.792
*** WARNING: Unable to verify timestamp for netw5v32.sys
*** ERROR: Module load completed but symbols could not be loaded for netw5v32.sys
Probably caused by : netw5v32.sys ( netw5v32+1f09b )
BUGCHECK_STR:  0xD1
PROCESS_NAME:  System
FAILURE_BUCKET_ID:  0xD1_CODE_AV_BAD_IP_netw5v32+1f09b
BiosReleaseDate = 04/21/2008
SystemManufacturer = Dell Inc.
SystemProductName = Vostro 1500                     
CPUID:        "Intel(R) Core(TM)2 Duo CPU     T5270  @ 1.40GHz"
MaxSpeed:     1400
CurrentSpeed: 1396
ииииииииииииииииииииииииииииииииииииииииииииииииииииииииииииииииииииииииииииииииииииии``
Built by: 7600.16539.x86fre.win7_gdr.100226-1909
Debug session time: Tue Aug  3 14:51:30.016 2010 (UTC - 4:00)
System Uptime: 0 days 2:26:21.076
Probably caused by : HIDCLASS.SYS ( HIDCLASS!HidpPdoPnp+189 )
BUGCHECK_STR:  0x8E
PROCESS_NAME:  svchost.exe
FAILURE_BUCKET_ID:  0x8E_HIDCLASS!HidpPdoPnp+189
BiosReleaseDate = 04/21/2008
SystemManufacturer = Dell Inc.
SystemProductName = Vostro 1500                     
CPUID:        "Intel(R) Core(TM)2 Duo CPU     T5270  @ 1.40GHz"
MaxSpeed:     1400
CurrentSpeed: 1396
ииииииииииииииииииииииииииииииииииииииииииииииииииииииииииииииииииииииииииииииииииииии``
Built by: 7600.16539.x86fre.win7_gdr.100226-1909
Debug session time: Sun Jul 18 08:06:46.202 2010 (UTC - 4:00)
System Uptime: 1 days 0:31:46.264
BUGCHECK_STR:  0x50
PROCESS_NAME:  explorer.exe
FAILURE_BUCKET_ID:  0x50_win32k!Win32AllocPool+13
BiosReleaseDate = 04/21/2008
SystemManufacturer = Dell Inc.
SystemProductName = Vostro 1500                     
CPUID:        "Intel(R) Core(TM)2 Duo CPU     T5270  @ 1.40GHz"
MaxSpeed:     1400
CurrentSpeed: 1396
ииииииииииииииииииииииииииииииииииииииииииииииииииииииииииииииииииииииииииииииииииииии``
  
My System SpecsSystem Spec
23 May 2011   #3

Windows 7 Ultimate 32bit
 
 
Have ran the tests ; now what to do ?

Hi there,
I have updated the intel drivers as instructed

Enable driver verifier (what should i do with this and how does it report a problem?)

ran the Memtest86 14 times (18 hours)- no errors reported
ran the Prime95 no faults so far - 3 hours and cpu at 58 degrees (ok i think)
ran the Hard drive scan usings SeaTools short and long -no faults found

what should i do now?
thanks for your help so far !
regards
john
My System SpecsSystem Spec
.


24 May 2011   #4

Windows 7 Ultimate 32bit
 
 
now ran the prime95 test for 10 hours with no problems - now what ?

HI now ran the prime95 test for 10 hours with no problems

your further help is appreciated!
My System SpecsSystem Spec
24 May 2011   #5

Microsoft Community Contributor Award Recipient

Windows 7 Home Premium 64bit
 
 

Quote   Quote: Originally Posted by johngo View Post
HI now ran the prime95 test for 10 hours with no problems

your further help is appreciated!
You need to make sure you run all three Prime95 tests (SmallFFTs, Large FFTs, and Blend) for three hours each.


Also type verifier /query in an elevated command prompt to make sure you have DV up and running properly. It should list all non-microsoft drivers. If it does then just continue to use your computer how you normally would until it causes a crash.
My System SpecsSystem Spec
25 May 2011   #6

Windows 7 Ultimate 32bit
 
 

hi there,
the stress test failed at 18 hours; what does this mean (data below)?
and
...make sure you have DV up and running properly - can you advise what dv is and how do i know?i have pasted contents of verifier below alsothanks againjohn

Code:
[May 24 18:50] Worker starting
[May 24 18:50] Setting affinity to run worker on logical CPU #2
[May 24 18:50] Beginning a continuous self-test to check your computer.
[May 24 18:50] Please read stress.txt.  Choose Test/Stop to end this test.
[May 24 18:50] Test 1, 9000 Lucas-Lehmer iterations of M8716289 using Pentium4 type-2 FFT length 448K, Pass1=448, Pass2=1K.
[May 24 18:53] Test 2, 9000 Lucas-Lehmer iterations of M8716287 using Core2 type-3 FFT length 448K, Pass1=448, Pass2=1K.
[May 24 18:56] Test 3, 9000 Lucas-Lehmer iterations of M8516289 using Pentium4 type-2 FFT length 448K, Pass1=448, Pass2=1K.
[May 24 18:59] Test 4, 9000 Lucas-Lehmer iterations of M8316287 using Core2 type-3 FFT length 448K, Pass1=448, Pass2=1K.
[May 24 19:02] Test 5, 9000 Lucas-Lehmer iterations of M8257537 using Pentium4 type-2 FFT length 448K, Pass1=448, Pass2=1K.
[May 24 19:04] Test 6, 9000 Lucas-Lehmer iterations of M8257535 using Core2 type-3 FFT length 448K, Pass1=448, Pass2=1K.
[May 24 19:07] Self-test 448K passed!
[May 24 19:07] Test 1, 34000 Lucas-Lehmer iterations of M2605473 using Core2 type-2 FFT length 128K, Pass1=512, Pass2=256.
[May 24 19:09] Test 2, 34000 Lucas-Lehmer iterations of M2584313 using Core2 type-3 FFT length 128K, Pass1=128, Pass2=1K.
[May 24 19:12] Test 3, 34000 Lucas-Lehmer iterations of M2573917 using Core2 type-2 FFT length 128K, Pass1=512, Pass2=256.
[May 24 19:14] Test 4, 34000 Lucas-Lehmer iterations of M2540831 using Core2 type-3 FFT length 128K, Pass1=128, Pass2=1K.
[May 24 19:17] Test 5, 34000 Lucas-Lehmer iterations of M2539613 using Core2 type-2 FFT length 128K, Pass1=512, Pass2=256.
[May 24 19:19] Test 6, 34000 Lucas-Lehmer iterations of M2495213 using Core2 type-3 FFT length 128K, Pass1=128, Pass2=1K.
[May 24 19:22] Self-test 128K passed!
[May 24 19:22] Test 1, 7800 Lucas-Lehmer iterations of M9961473 using Core2 type-2 FFT length 512K, Pass1=512, Pass2=1K.
[May 24 19:24] Test 2, 7800 Lucas-Lehmer iterations of M9961471 using Core2 type-3 FFT length 512K, Pass1=512, Pass2=1K.
[May 24 19:27] Test 3, 7800 Lucas-Lehmer iterations of M9837183 using Core2 type-2 FFT length 512K, Pass1=512, Pass2=1K.
[May 24 19:29] Test 4, 7800 Lucas-Lehmer iterations of M9737185 using Core2 type-3 FFT length 512K, Pass1=512, Pass2=1K.
[May 24 19:32] Test 5, 7800 Lucas-Lehmer iterations of M9537183 using Core2 type-2 FFT length 512K, Pass1=512, Pass2=1K.
[May 24 19:34] Test 6, 7800 Lucas-Lehmer iterations of M9437185 using Core2 type-3 FFT length 512K, Pass1=512, Pass2=1K.
[May 24 19:37] Test 7, 7800 Lucas-Lehmer iterations of M9437183 using Core2 type-2 FFT length 512K, Pass1=512, Pass2=1K.
[May 24 19:39] Self-test 512K passed!
[May 24 19:39] Test 1, 27000 Lucas-Lehmer iterations of M3242961 using Pentium4 type-2 FFT length 160K, Pass1=640, Pass2=256.
[May 24 19:42] Test 2, 27000 Lucas-Lehmer iterations of M3172959 using Pentium4 type-3 FFT length 160K, Pass1=640, Pass2=256.
[May 24 19:44] Test 3, 27000 Lucas-Lehmer iterations of M3112961 using Pentium4 type-2 FFT length 160K, Pass1=640, Pass2=256.
[May 24 19:47] Test 4, 27000 Lucas-Lehmer iterations of M3112959 using Pentium4 type-3 FFT length 160K, Pass1=640, Pass2=256.
[May 24 19:49] Test 5, 27000 Lucas-Lehmer iterations of M2949121 using Pentium4 type-2 FFT length 160K, Pass1=640, Pass2=256.
[May 24 19:52] Test 6, 27000 Lucas-Lehmer iterations of M2949119 using Pentium4 type-3 FFT length 160K, Pass1=640, Pass2=256.
[May 24 19:55] Self-test 160K passed!
[May 24 19:55] Test 1, 6500 Lucas-Lehmer iterations of M11285761 using Core2 type-2 FFT length 576K, Pass1=768, Pass2=768.
[May 24 19:57] Test 2, 6500 Lucas-Lehmer iterations of M10885759 using Core2 type-3 FFT length 576K, Pass1=768, Pass2=768.
[May 24 19:59] Test 3, 6500 Lucas-Lehmer iterations of M10485761 using Core2 type-2 FFT length 576K, Pass1=768, Pass2=768.
[May 24 20:02] Test 4, 6500 Lucas-Lehmer iterations of M10485759 using Core2 type-3 FFT length 576K, Pass1=768, Pass2=768.
[May 24 20:05] Test 5, 7800 Lucas-Lehmer iterations of M9961473 using Core2 type-2 FFT length 576K, Pass1=768, Pass2=768.
[May 24 20:08] Test 6, 7800 Lucas-Lehmer iterations of M9961471 using Core2 type-3 FFT length 576K, Pass1=768, Pass2=768.
[May 24 20:11] Self-test 576K passed!
[May 24 20:11] Test 1, 19000 Lucas-Lehmer iterations of M4501145 using Pentium4 type-2 FFT length 224K, Pass1=896, Pass2=256.
[May 24 20:13] Test 2, 19000 Lucas-Lehmer iterations of M4458143 using Pentium4 type-3 FFT length 224K, Pass1=896, Pass2=256.
[May 24 20:16] Test 3, 19000 Lucas-Lehmer iterations of M4358145 using Pentium4 type-2 FFT length 224K, Pass1=896, Pass2=256.
[May 24 20:21] Test 4, 19000 Lucas-Lehmer iterations of M4358143 using Pentium4 type-3 FFT length 224K, Pass1=896, Pass2=256.
[May 24 20:23] Test 5, 19000 Lucas-Lehmer iterations of M4298769 using Pentium4 type-2 FFT length 224K, Pass1=896, Pass2=256.
[May 24 20:26] Self-test 224K passed!
[May 24 20:26] Test 1, 5300 Lucas-Lehmer iterations of M13069345 using Core2 type-2 FFT length 672K, Pass1=896, Pass2=768.
[May 24 20:28] Test 2, 5300 Lucas-Lehmer iterations of M12969343 using Core2 type-3 FFT length 672K, Pass1=896, Pass2=768.
[May 24 20:30] Test 3, 6500 Lucas-Lehmer iterations of M12451841 using Core2 type-2 FFT length 672K, Pass1=896, Pass2=768.
[May 24 20:33] Test 4, 6500 Lucas-Lehmer iterations of M12451839 using Core2 type-3 FFT length 672K, Pass1=896, Pass2=768.
[May 24 21:29] Self-test 672K passed!
[May 24 21:29] Test 1, 17000 Lucas-Lehmer iterations of M5120737 using Core2 type-2 FFT length 256K, Pass1=1K, Pass2=256.
[May 24 21:32] Test 2, 17000 Lucas-Lehmer iterations of M5030735 using Core2 type-3 FFT length 256K, Pass1=1K, Pass2=256.
[May 24 21:34] Test 3, 17000 Lucas-Lehmer iterations of M4980737 using Core2 type-2 FFT length 256K, Pass1=1K, Pass2=256.
[May 24 21:37] Test 4, 17000 Lucas-Lehmer iterations of M4980735 using Core2 type-3 FFT length 256K, Pass1=1K, Pass2=256.
[May 24 21:40] Test 5, 17000 Lucas-Lehmer iterations of M4888593 using Core2 type-2 FFT length 256K, Pass1=1K, Pass2=256.
[May 24 21:42] Test 6, 17000 Lucas-Lehmer iterations of M4818591 using Core2 type-3 FFT length 256K, Pass1=1K, Pass2=256.
[May 24 21:45] Self-test 256K passed!
[May 24 21:45] Test 1, 4500 Lucas-Lehmer iterations of M15597569 using Core2 type-2 FFT length 800K, Pass1=640, Pass2=1280.
[May 24 21:47] Test 2, 4500 Lucas-Lehmer iterations of M15597567 using Core2 type-3 FFT length 800K, Pass1=640, Pass2=1280.
[May 24 21:50] Test 3, 5300 Lucas-Lehmer iterations of M14942209 using Core2 type-2 FFT length 800K, Pass1=640, Pass2=1280.
[May 24 21:53] Test 4, 5300 Lucas-Lehmer iterations of M14942207 using Core2 type-3 FFT length 800K, Pass1=640, Pass2=1280.
[May 24 21:55] Test 5, 5300 Lucas-Lehmer iterations of M14155777 using Core2 type-2 FFT length 800K, Pass1=640, Pass2=1280.
[May 24 21:58] Test 6, 5300 Lucas-Lehmer iterations of M14155775 using Core2 type-3 FFT length 800K, Pass1=640, Pass2=1280.
[May 24 22:01] Self-test 800K passed!
[May 24 22:01] Test 1, 13000 Lucas-Lehmer iterations of M6225921 using Core2 type-2 FFT length 320K, Pass1=320, Pass2=1K.
[May 24 22:04] Test 2, 13000 Lucas-Lehmer iterations of M6225919 using Core2 type-3 FFT length 320K, Pass1=320, Pass2=1K.
[May 24 22:06] Test 3, 13000 Lucas-Lehmer iterations of M6198241 using Core2 type-2 FFT length 320K, Pass1=320, Pass2=1K.
[May 24 22:08] Test 4, 13000 Lucas-Lehmer iterations of M6098239 using Core2 type-3 FFT length 320K, Pass1=320, Pass2=1K.
[May 24 22:11] Test 5, 13000 Lucas-Lehmer iterations of M5898241 using Core2 type-2 FFT length 320K, Pass1=320, Pass2=1K.
[May 24 22:21] Self-test 320K passed!
[May 24 22:21] Test 1, 4000 Lucas-Lehmer iterations of M18474367 using Core2 type-2 FFT length 960K, Pass1=1280, Pass2=768.
[May 24 22:24] Test 2, 4000 Lucas-Lehmer iterations of M18274367 using Core2 type-3 FFT length 960K, Pass1=768, Pass2=1280.
[May 24 22:26] Test 3, 4000 Lucas-Lehmer iterations of M18274369 using Core2 type-2 FFT length 960K, Pass1=1280, Pass2=768.
[May 25 07:17] Self-test 960K passed!
[May 25 07:17] Test 1, 11000 Lucas-Lehmer iterations of M7471105 using Pentium4 type-2 FFT length 384K, Pass1=512, Pass2=768.
[May 25 07:20] Test 2, 11000 Lucas-Lehmer iterations of M7471103 using Core2 type-3 FFT length 384K, Pass1=512, Pass2=768.
[May 25 07:23] Test 3, 11000 Lucas-Lehmer iterations of M7377889 using Pentium4 type-2 FFT length 384K, Pass1=512, Pass2=768.
[May 25 07:25] Test 4, 11000 Lucas-Lehmer iterations of M7277887 using Core2 type-3 FFT length 384K, Pass1=512, Pass2=768.
[May 25 07:28] Test 5, 11000 Lucas-Lehmer iterations of M7077889 using Pentium4 type-2 FFT length 384K, Pass1=512, Pass2=768.
[May 25 07:30] Test 6, 11000 Lucas-Lehmer iterations of M7077887 using Core2 type-3 FFT length 384K, Pass1=512, Pass2=768.
[May 25 07:33] Self-test 384K passed!
[May 25 07:33] Test 1, 7800 Lucas-Lehmer iterations of M9537183 using Core2 type-2 FFT length 480K, Pass1=640, Pass2=768.
[May 25 07:35] Test 2, 7800 Lucas-Lehmer iterations of M9437185 using Core2 type-3 FFT length 480K, Pass1=640, Pass2=768.
[May 25 07:42] Test 3, 7800 Lucas-Lehmer iterations of M9437183 using Core2 type-2 FFT length 480K, Pass1=640, Pass2=768.
[May 25 07:45] Test 4, 7800 Lucas-Lehmer iterations of M9337185 using Core2 type-3 FFT length 480K, Pass1=640, Pass2=768.
[May 25 07:47] Test 5, 7800 Lucas-Lehmer iterations of M9237183 using Core2 type-2 FFT length 480K, Pass1=640, Pass2=768.
[May 25 07:49] Self-test 480K passed!
[May 25 07:49] Test 1, 27000 Lucas-Lehmer iterations of M2885281 using Pentium4 type-1 FFT length 144K, Pass1=96, Pass2=1536.
[May 25 07:52] Test 2, 27000 Lucas-Lehmer iterations of M2785281 using Pentium4 type-1 FFT length 144K, Pass1=96, Pass2=1536.
[May 25 07:54] Test 3, 27000 Lucas-Lehmer iterations of M2785279 using Pentium4 type-1 FFT length 144K, Pass1=96, Pass2=1536.
[May 25 07:57] Test 4, 27000 Lucas-Lehmer iterations of M2685279 using Pentium4 type-1 FFT length 144K, Pass1=96, Pass2=1536.
[May 25 07:59] Test 5, 34000 Lucas-Lehmer iterations of M2605473 using Pentium4 type-1 FFT length 144K, Pass1=96, Pass2=1536.
[May 25 08:02] Test 6, 34000 Lucas-Lehmer iterations of M2584313 using Pentium4 type-1 FFT length 144K, Pass1=96, Pass2=1536.
[May 25 08:05] Self-test 144K passed!
[May 25 08:05] Test 1, 6500 Lucas-Lehmer iterations of M10885759 using Core2 type-2 FFT length 560K, Pass1=448, Pass2=1280.
[May 25 08:07] Test 2, 6500 Lucas-Lehmer iterations of M10485761 using Core2 type-3 FFT length 560K, Pass1=448, Pass2=1280.
[May 25 08:10] Test 3, 6500 Lucas-Lehmer iterations of M10485759 using Core2 type-2 FFT length 560K, Pass1=448, Pass2=1280.
[May 25 08:12] Test 4, 7800 Lucas-Lehmer iterations of M9961473 using Core2 type-3 FFT length 560K, Pass1=448, Pass2=1280.
[May 25 08:15] Test 5, 7800 Lucas-Lehmer iterations of M9961471 using Core2 type-2 FFT length 560K, Pass1=448, Pass2=1280.
[May 25 08:17] Test 6, 7800 Lucas-Lehmer iterations of M9837183 using Core2 type-3 FFT length 560K, Pass1=448, Pass2=1280.
[May 25 08:20] Test 7, 7800 Lucas-Lehmer iterations of M9737185 using Core2 type-2 FFT length 560K, Pass1=448, Pass2=1280.
[May 25 08:23] Self-test 560K passed!
[May 25 08:23] Test 1, 22000 Lucas-Lehmer iterations of M3835553 using Pentium4 type-2 FFT length 192K, Pass1=256, Pass2=768.
[May 25 08:25] Test 2, 22000 Lucas-Lehmer iterations of M3785551 using Pentium4 type-3 FFT length 192K, Pass1=256, Pass2=768.
[May 25 08:27] Test 3, 22000 Lucas-Lehmer iterations of M3735553 using Pentium4 type-2 FFT length 192K, Pass1=256, Pass2=768.
[May 25 08:30] Test 4, 22000 Lucas-Lehmer iterations of M3735551 using Pentium4 type-3 FFT length 192K, Pass1=256, Pass2=768.
[May 25 08:32] Test 5, 22000 Lucas-Lehmer iterations of M3688945 using Pentium4 type-2 FFT length 192K, Pass1=256, Pass2=768.
[May 25 08:34] Test 6, 22000 Lucas-Lehmer iterations of M3618943 using Pentium4 type-3 FFT length 192K, Pass1=256, Pass2=768.
[May 25 08:38] Self-test 192K passed!
[May 25 08:38] Test 1, 6500 Lucas-Lehmer iterations of M12451841 using Core2 type-2 FFT length 640K, Pass1=640, Pass2=1K.
[May 25 08:40] Test 2, 6500 Lucas-Lehmer iterations of M12451839 using Core2 type-3 FFT length 640K, Pass1=640, Pass2=1K.
[May 25 08:43] Test 3, 6500 Lucas-Lehmer iterations of M12196481 using Core2 type-2 FFT length 640K, Pass1=640, Pass2=1K.
[May 25 08:45] Test 4, 6500 Lucas-Lehmer iterations of M11796481 using Core2 type-3 FFT length 640K, Pass1=640, Pass2=1K.
[May 25 08:48] Test 5, 6500 Lucas-Lehmer iterations of M11796479 using Core2 type-2 FFT length 640K, Pass1=640, Pass2=1K.
[May 25 08:50] Test 6, 6500 Lucas-Lehmer iterations of M11596479 using Core2 type-3 FFT length 640K, Pass1=640, Pass2=1K.
[May 25 08:53] Test 7, 6500 Lucas-Lehmer iterations of M11285761 using Core2 type-2 FFT length 640K, Pass1=640, Pass2=1K.
[May 25 08:55] Self-test 640K passed!
[May 25 08:55] Test 1, 17000 Lucas-Lehmer iterations of M4818591 using Pentium4 type-2 FFT length 240K, Pass1=320, Pass2=768.
[May 25 08:58] Test 2, 17000 Lucas-Lehmer iterations of M4718593 using Pentium4 type-3 FFT length 240K, Pass1=320, Pass2=768.
[May 25 09:00] Test 3, 17000 Lucas-Lehmer iterations of M4718591 using Pentium4 type-2 FFT length 240K, Pass1=320, Pass2=768.
[May 25 09:02] Test 4, 17000 Lucas-Lehmer iterations of M4698593 using Pentium4 type-3 FFT length 240K, Pass1=320, Pass2=768.
[May 25 09:05] Test 5, 17000 Lucas-Lehmer iterations of M4648591 using Pentium4 type-2 FFT length 240K, Pass1=320, Pass2=768.
[May 25 09:07] Test 6, 19000 Lucas-Lehmer iterations of M4501145 using Pentium4 type-3 FFT length 240K, Pass1=320, Pass2=768.
[May 25 09:10] Test 7, 19000 Lucas-Lehmer iterations of M4458143 using Pentium4 type-2 FFT length 240K, Pass1=320, Pass2=768.
[May 25 09:12] Self-test 240K passed!
[May 25 09:12] Test 1, 5300 Lucas-Lehmer iterations of M14942209 using Core2 type-2 FFT length 768K, Pass1=768, Pass2=1K.
[May 25 09:15] Test 2, 5300 Lucas-Lehmer iterations of M14942207 using Core2 type-3 FFT length 768K, Pass1=1K, Pass2=768.
[May 25 09:17] Test 3, 5300 Lucas-Lehmer iterations of M14155777 using Core2 type-2 FFT length 768K, Pass1=768, Pass2=1K.
[May 25 09:20] Test 4, 5300 Lucas-Lehmer iterations of M14155775 using Core2 type-3 FFT length 768K, Pass1=1K, Pass2=768.
[May 25 09:22] Test 5, 5300 Lucas-Lehmer iterations of M13969343 using Core2 type-2 FFT length 768K, Pass1=768, Pass2=1K.
[May 25 09:25] Test 6, 5300 Lucas-Lehmer iterations of M13669345 using Core2 type-3 FFT length 768K, Pass1=1K, Pass2=768.
[May 25 09:27] Self-test 768K passed!
[May 25 09:27] Test 1, 13000 Lucas-Lehmer iterations of M5705025 using Core2 type-2 FFT length 288K, Pass1=384, Pass2=768.
[May 25 09:30] Test 2, 13000 Lucas-Lehmer iterations of M5605023 using Core2 type-3 FFT length 288K, Pass1=384, Pass2=768.
[May 25 09:32] Test 3, 13000 Lucas-Lehmer iterations of M5505025 using Core2 type-2 FFT length 288K, Pass1=384, Pass2=768.
[May 25 09:34] Test 4, 13000 Lucas-Lehmer iterations of M5505023 using Core2 type-3 FFT length 288K, Pass1=384, Pass2=768.
[May 25 09:36] Test 5, 17000 Lucas-Lehmer iterations of M5120737 using Core2 type-2 FFT length 288K, Pass1=384, Pass2=768.
[May 25 09:39] Test 6, 17000 Lucas-Lehmer iterations of M5030735 using Core2 type-3 FFT length 288K, Pass1=384, Pass2=768.
[May 25 09:42] Test 7, 17000 Lucas-Lehmer iterations of M4980737 using Core2 type-2 FFT length 288K, Pass1=384, Pass2=768.
[May 25 09:45] Self-test 288K passed!
[May 25 09:45] Test 1, 4500 Lucas-Lehmer iterations of M17432577 using Core2 type-2 FFT length 896K, Pass1=896, Pass2=1K.
[May 25 09:48] Test 2, 4500 Lucas-Lehmer iterations of M17432575 using Core2 type-3 FFT length 896K, Pass1=896, Pass2=1K.
[May 25 09:50] Test 3, 4500 Lucas-Lehmer iterations of M17115073 using Core2 type-2 FFT length 896K, Pass1=896, Pass2=1K.
[May 25 09:53] Test 4, 4500 Lucas-Lehmer iterations of M16815071 using Core2 type-3 FFT length 896K, Pass1=896, Pass2=1K.
[May 25 09:55] Test 5, 4500 Lucas-Lehmer iterations of M16515073 using Core2 type-2 FFT length 896K, Pass1=896, Pass2=1K.
[May 25 09:58] Test 6, 4500 Lucas-Lehmer iterations of M16515071 using Core2 type-3 FFT length 896K, Pass1=896, Pass2=1K.
[May 25 10:00] Self-test 896K passed!
[May 25 10:00] Test 1, 11000 Lucas-Lehmer iterations of M6684673 using Pentium4 type-2 FFT length 336K, Pass1=448, Pass2=768.
[May 25 10:03] Test 2, 11000 Lucas-Lehmer iterations of M6684671 using Pentium4 type-3 FFT length 336K, Pass1=448, Pass2=768.
[May 25 10:05] Test 3, 13000 Lucas-Lehmer iterations of M6225921 using Pentium4 type-2 FFT length 336K, Pass1=448, Pass2=768.
[May 25 10:07] Test 4, 13000 Lucas-Lehmer iterations of M6225919 using Pentium4 type-3 FFT length 336K, Pass1=448, Pass2=768.
[May 25 10:10] Test 5, 13000 Lucas-Lehmer iterations of M6198241 using Pentium4 type-2 FFT length 336K, Pass1=448, Pass2=768.
[May 25 10:13] Test 6, 13000 Lucas-Lehmer iterations of M6098239 using Pentium4 type-3 FFT length 336K, Pass1=448, Pass2=768.
[May 25 10:15] Test 7, 13000 Lucas-Lehmer iterations of M5898241 using Pentium4 type-2 FFT length 336K, Pass1=448, Pass2=768.
[May 25 10:18] Self-test 336K passed!
[May 25 10:18] Test 1, 4000 Lucas-Lehmer iterations of M19922945 using Core2 type-2 FFT length 1M, Pass1=1K, Pass2=1K.
[May 25 10:21] Test 2, 4000 Lucas-Lehmer iterations of M19922943 using Core2 type-3 FFT length 1M, Pass1=1K, Pass2=1K.
[May 25 10:23] Test 3, 4000 Lucas-Lehmer iterations of M19374367 using Core2 type-2 FFT length 1M, Pass1=1K, Pass2=1K.
[May 25 10:26] Test 4, 4000 Lucas-Lehmer iterations of M19174369 using Core2 type-3 FFT length 1M, Pass1=1K, Pass2=1K.
[May 25 10:28] Test 5, 4000 Lucas-Lehmer iterations of M18874369 using Core2 type-2 FFT length 1M, Pass1=1K, Pass2=1K.
[May 25 10:31] Test 6, 4000 Lucas-Lehmer iterations of M18874367 using Core2 type-3 FFT length 1M, Pass1=1K, Pass2=1K.
[May 25 10:33] Self-test 1024K passed!
[May 25 10:33] Test 1, 9000 Lucas-Lehmer iterations of M7798785 using Core2 type-2 FFT length 400K, Pass1=320, Pass2=1280.
[May 25 10:35] Test 2, 9000 Lucas-Lehmer iterations of M7798783 using Core2 type-3 FFT length 400K, Pass1=320, Pass2=1280.
[May 25 10:37] Test 3, 11000 Lucas-Lehmer iterations of M7471105 using Core2 type-2 FFT length 400K, Pass1=320, Pass2=1280.
[May 25 10:40] Test 4, 11000 Lucas-Lehmer iterations of M7471103 using Core2 type-3 FFT length 400K, Pass1=320, Pass2=1280.
[May 25 10:43] Test 5, 11000 Lucas-Lehmer iterations of M7377889 using Core2 type-2 FFT length 400K, Pass1=320, Pass2=1280.
[May 25 10:45] Test 6, 11000 Lucas-Lehmer iterations of M7277887 using Core2 type-3 FFT length 400K, Pass1=320, Pass2=1280.
[May 25 10:48] Test 7, 11000 Lucas-Lehmer iterations of M7077889 using Core2 type-2 FFT length 400K, Pass1=320, Pass2=1280.
[May 25 10:51] Self-test 400K passed!
[May 25 10:51] Test 1, 9000 Lucas-Lehmer iterations of M8098785 using Pentium4 type-2 FFT length 448K, Pass1=448, Pass2=1K.
[May 25 10:53] Test 2, 9000 Lucas-Lehmer iterations of M7998783 using Core2 type-3 FFT length 448K, Pass1=448, Pass2=1K.
[May 25 10:55] Test 3, 9000 Lucas-Lehmer iterations of M7798785 using Pentium4 type-2 FFT length 448K, Pass1=448, Pass2=1K.
[May 25 10:58] Test 4, 9000 Lucas-Lehmer iterations of M7798783 using Core2 type-3 FFT length 448K, Pass1=448, Pass2=1K.
[May 25 11:00] Test 5, 11000 Lucas-Lehmer iterations of M7471105 using Pentium4 type-2 FFT length 448K, Pass1=448, Pass2=1K.
[May 25 11:03] Test 6, 11000 Lucas-Lehmer iterations of M7471103 using Core2 type-3 FFT length 448K, Pass1=448, Pass2=1K.
[May 25 11:06] Self-test 448K passed!
[May 25 11:06] Test 1, 34000 Lucas-Lehmer iterations of M2408447 using Core2 type-2 FFT length 128K, Pass1=512, Pass2=256.
[May 25 11:09] Test 2, 34000 Lucas-Lehmer iterations of M2388831 using Core2 type-3 FFT length 128K, Pass1=128, Pass2=1K.
[May 25 11:11] Test 3, 34000 Lucas-Lehmer iterations of M2359297 using Core2 type-2 FFT length 128K, Pass1=512, Pass2=256.
[May 25 11:13] Test 4, 34000 Lucas-Lehmer iterations of M2359295 using Core2 type-3 FFT length 128K, Pass1=128, Pass2=1K.
[May 25 11:16] Test 5, 39000 Lucas-Lehmer iterations of M2244765 using Core2 type-2 FFT length 128K, Pass1=512, Pass2=256.
[May 25 11:19] Test 6, 39000 Lucas-Lehmer iterations of M2236671 using Core2 type-3 FFT length 128K, Pass1=128, Pass2=1K.
[May 25 11:22] Self-test 128K passed!
[May 25 11:22] Test 1, 7800 Lucas-Lehmer iterations of M9337185 using Core2 type-2 FFT length 512K, Pass1=512, Pass2=1K.
[May 25 11:24] Test 2, 7800 Lucas-Lehmer iterations of M9237183 using Core2 type-3 FFT length 512K, Pass1=512, Pass2=1K.
[May 25 11:26] Test 3, 7800 Lucas-Lehmer iterations of M9137185 using Core2 type-2 FFT length 512K, Pass1=512, Pass2=1K.
[May 25 11:29] Test 4, 9000 Lucas-Lehmer iterations of M8716289 using Core2 type-3 FFT length 512K, Pass1=512, Pass2=1K.
[May 25 11:31] Test 5, 9000 Lucas-Lehmer iterations of M8716287 using Core2 type-2 FFT length 512K, Pass1=512, Pass2=1K.
[May 25 11:34] Test 6, 9000 Lucas-Lehmer iterations of M8516289 using Core2 type-3 FFT length 512K, Pass1=512, Pass2=1K.
[May 25 11:37] Self-test 512K passed!
[May 25 11:37] Test 1, 27000 Lucas-Lehmer iterations of M2885281 using Pentium4 type-2 FFT length 160K, Pass1=640, Pass2=256.
[May 25 11:39] Test 2, 27000 Lucas-Lehmer iterations of M2785281 using Pentium4 type-3 FFT length 160K, Pass1=640, Pass2=256.
[May 25 11:42] Test 3, 27000 Lucas-Lehmer iterations of M2785279 using Pentium4 type-2 FFT length 160K, Pass1=640, Pass2=256.
[May 25 11:44] Test 4, 27000 Lucas-Lehmer iterations of M2685279 using Pentium4 type-3 FFT length 160K, Pass1=640, Pass2=256.
[May 25 11:46] Test 5, 34000 Lucas-Lehmer iterations of M2605473 using Pentium4 type-2 FFT length 160K, Pass1=640, Pass2=256.
[May 25 11:49] Test 6, 34000 Lucas-Lehmer iterations of M2584313 using Pentium4 type-3 FFT length 160K, Pass1=640, Pass2=256.
[May 25 11:52] Self-test 160K passed!
[May 25 11:52] Test 1, 7800 Lucas-Lehmer iterations of M9837183 using Core2 type-2 FFT length 576K, Pass1=768, Pass2=768.
[May 25 11:55] Test 2, 7800 Lucas-Lehmer iterations of M9737185 using Core2 type-3 FFT length 576K, Pass1=768, Pass2=768.
[May 25 11:58] Test 3, 7800 Lucas-Lehmer iterations of M9537183 using Core2 type-2 FFT length 576K, Pass1=768, Pass2=768.
[May 25 12:01] Test 4, 7800 Lucas-Lehmer iterations of M9437185 using Core2 type-3 FFT length 576K, Pass1=768, Pass2=768.
[May 25 12:04] Test 5, 7800 Lucas-Lehmer iterations of M9437183 using Core2 type-2 FFT length 576K, Pass1=768, Pass2=768.
[May 25 12:08] Self-test 576K passed!
[May 25 12:08] Test 1, 19000 Lucas-Lehmer iterations of M4228767 using Pentium4 type-2 FFT length 224K, Pass1=896, Pass2=256.
[May 25 12:11] Test 2, 19000 Lucas-Lehmer iterations of M4128769 using Pentium4 type-3 FFT length 224K, Pass1=896, Pass2=256.
[May 25 12:14] Test 3, 19000 Lucas-Lehmer iterations of M4128767 using Pentium4 type-2 FFT length 224K, Pass1=896, Pass2=256.
[May 25 12:17] Test 4, 19000 Lucas-Lehmer iterations of M4028769 using Pentium4 type-3 FFT length 224K, Pass1=896, Pass2=256.
[May 25 12:21] Test 5, 19000 Lucas-Lehmer iterations of M3978767 using Pentium4 type-2 FFT length 224K, Pass1=896, Pass2=256.
[May 25 12:24] Self-test 224K passed!
[May 25 12:24] Test 1, 6500 Lucas-Lehmer iterations of M12196481 using Core2 type-2 FFT length 672K, Pass1=896, Pass2=768.
[May 25 12:28] Test 2, 6500 Lucas-Lehmer iterations of M11796481 using Core2 type-3 FFT length 672K, Pass1=896, Pass2=768.
[May 25 12:32] Test 3, 6500 Lucas-Lehmer iterations of M11796479 using Core2 type-2 FFT length 672K, Pass1=896, Pass2=768.
[May 25 12:35] Test 4, 6500 Lucas-Lehmer iterations of M11596479 using Core2 type-3 FFT length 672K, Pass1=896, Pass2=768.
[May 25 12:38] Test 5, 6500 Lucas-Lehmer iterations of M11285761 using Core2 type-2 FFT length 672K, Pass1=896, Pass2=768.
[May 25 12:40] Self-test 672K passed!
[May 25 12:40] Test 1, 17000 Lucas-Lehmer iterations of M4718593 using Core2 type-2 FFT length 256K, Pass1=1K, Pass2=256.
[May 25 12:43] Test 2, 17000 Lucas-Lehmer iterations of M4718591 using Core2 type-3 FFT length 256K, Pass1=1K, Pass2=256.
[May 25 12:45] Test 3, 17000 Lucas-Lehmer iterations of M4698593 using Core2 type-2 FFT length 256K, Pass1=1K, Pass2=256.
[May 25 12:48] Test 4, 17000 Lucas-Lehmer iterations of M4648591 using Core2 type-3 FFT length 256K, Pass1=1K, Pass2=256.
[May 25 12:50] Test 5, 19000 Lucas-Lehmer iterations of M4501145 using Core2 type-2 FFT length 256K, Pass1=1K, Pass2=256.
[May 25 12:53] Test 6, 19000 Lucas-Lehmer iterations of M4458143 using Core2 type-3 FFT length 256K, Pass1=1K, Pass2=256.
[May 25 12:56] Self-test 256K passed!
[May 25 12:56] Test 1, 5300 Lucas-Lehmer iterations of M13969343 using Core2 type-2 FFT length 800K, Pass1=640, Pass2=1280.
[May 25 12:59] Test 2, 5300 Lucas-Lehmer iterations of M13669345 using Core2 type-3 FFT length 800K, Pass1=640, Pass2=1280.
[May 25 13:01] Test 3, 5300 Lucas-Lehmer iterations of M13369345 using Core2 type-2 FFT length 800K, Pass1=640, Pass2=1280.
[May 25 13:04] Test 4, 5300 Lucas-Lehmer iterations of M13369343 using Core2 type-3 FFT length 800K, Pass1=640, Pass2=1280.
[May 25 13:07] Test 5, 5300 Lucas-Lehmer iterations of M13069345 using Core2 type-2 FFT length 800K, Pass1=640, Pass2=1280.
[May 25 13:09] Test 6, 5300 Lucas-Lehmer iterations of M12969343 using Core2 type-3 FFT length 800K, Pass1=640, Pass2=1280.
[May 25 13:12] Self-test 800K passed!
[May 25 13:12] Test 1, 13000 Lucas-Lehmer iterations of M5898239 using Core2 type-2 FFT length 320K, Pass1=320, Pass2=1K.
[May 25 13:14] Test 2, 13000 Lucas-Lehmer iterations of M5705025 using Core2 type-3 FFT length 320K, Pass1=320, Pass2=1K.
[May 25 13:17] Test 3, 13000 Lucas-Lehmer iterations of M5605023 using Core2 type-2 FFT length 320K, Pass1=320, Pass2=1K.
[May 25 13:19] Test 4, 13000 Lucas-Lehmer iterations of M5505025 using Core2 type-3 FFT length 320K, Pass1=320, Pass2=1K.
[May 25 13:21] Test 5, 13000 Lucas-Lehmer iterations of M5505023 using Core2 type-2 FFT length 320K, Pass1=320, Pass2=1K.
[May 25 13:24] Test 6, 17000 Lucas-Lehmer iterations of M5120737 using Core2 type-3 FFT length 320K, Pass1=320, Pass2=1K.
[May 25 13:27] Self-test 320K passed!
[May 25 13:27] Test 1, 4000 Lucas-Lehmer iterations of M18074369 using Core2 type-2 FFT length 960K, Pass1=1280, Pass2=768.
[May 25 13:29] Test 2, 4500 Lucas-Lehmer iterations of M17432577 using Core2 type-3 FFT length 960K, Pass1=768, Pass2=1280.
[May 25 13:32] Test 3, 4500 Lucas-Lehmer iterations of M17432575 using Core2 type-2 FFT length 960K, Pass1=1280, Pass2=768.
[May 25 13:35] Test 4, 4500 Lucas-Lehmer iterations of M17115073 using Core2 type-3 FFT length 960K, Pass1=768, Pass2=1280.
[May 25 13:38] FATAL ERROR: Rounding was 0.5, expected less than 0.4
[May 25 13:38] Hardware failure detected, consult stress.txt file.
[May 25 13:38] Torture Test completed 203 tests in 18 hours, 48 minutes - 1 errors, 0 warnings.
[May 25 13:38] Worker stopped.

 
Microsoft Windows [Version 6.1.7601]
Copyright (c) 2009 Microsoft Corporation.  All rights reserved.
C:\Windows\system32>verifier /query
25/05/2011, 16:53:57
Level: 00000FBB
RaiseIrqls: 1538682
AcquireSpinLocks: 112601031
SynchronizeExecutions: 39
AllocationsAttempted: 52626624
AllocationsSucceeded: 52626624
AllocationsSucceededSpecialPool: 52626624
AllocationsWithNoTag: 49
AllocationsFailed: 0
AllocationsFailedDeliberately: 0
Trims: 3110996
UnTrackedPool: 33035645
Verified drivers:
Name: amdxata.sys, loads: 1, unloads: 0
CurrentPagedPoolAllocations: 0
CurrentNonPagedPoolAllocations: 0
PeakPagedPoolAllocations: 0
PeakNonPagedPoolAllocations: 0
PagedPoolUsageInBytes: 0
NonPagedPoolUsageInBytes: 0
PeakPagedPoolUsageInBytes: 0
PeakNonPagedPoolUsageInBytes: 0
Name: avgtdix.sys, loads: 1, unloads: 0
CurrentPagedPoolAllocations: 101
CurrentNonPagedPoolAllocations: 1359
PeakPagedPoolAllocations: 130
PeakNonPagedPoolAllocations: 1643
PagedPoolUsageInBytes: 12244
NonPagedPoolUsageInBytes: 271004
PeakPagedPoolUsageInBytes: 15644
PeakNonPagedPoolUsageInBytes: 420436
Name: avgmfx86.sys, loads: 1, unloads: 0
CurrentPagedPoolAllocations: 2
CurrentNonPagedPoolAllocations: 7
PeakPagedPoolAllocations: 3
PeakNonPagedPoolAllocations: 9
PagedPoolUsageInBytes: 908
NonPagedPoolUsageInBytes: 376
PeakPagedPoolUsageInBytes: 5012
PeakNonPagedPoolUsageInBytes: 408
Name: avgldx86.sys, loads: 1, unloads: 0
CurrentPagedPoolAllocations: 154
CurrentNonPagedPoolAllocations: 20
PeakPagedPoolAllocations: 216
PeakNonPagedPoolAllocations: 29
PagedPoolUsageInBytes: 14636
NonPagedPoolUsageInBytes: 1880
PeakPagedPoolUsageInBytes: 74992
PeakNonPagedPoolUsageInBytes: 11004
Name: igdkmd32.sys, loads: 1, unloads: 0
CurrentPagedPoolAllocations: 8
CurrentNonPagedPoolAllocations: 813
PeakPagedPoolAllocations: 11
PeakNonPagedPoolAllocations: 1276
PagedPoolUsageInBytes: 274588
NonPagedPoolUsageInBytes: 2461396
PeakPagedPoolUsageInBytes: 291048
PeakNonPagedPoolUsageInBytes: 2922444
Name: bcm4sbxp.sys, loads: 1, unloads: 0
CurrentPagedPoolAllocations: 0
CurrentNonPagedPoolAllocations: 0
PeakPagedPoolAllocations: 0
PeakNonPagedPoolAllocations: 0
PagedPoolUsageInBytes: 0
NonPagedPoolUsageInBytes: 0
PeakPagedPoolUsageInBytes: 0
PeakNonPagedPoolUsageInBytes: 0
Name: ndis.sys, loads: 1, unloads: 0
CurrentPagedPoolAllocations: 6
CurrentNonPagedPoolAllocations: 1156
PeakPagedPoolAllocations: 8
PeakNonPagedPoolAllocations: 1233
PagedPoolUsageInBytes: 984
NonPagedPoolUsageInBytes: 7474840
PeakPagedPoolUsageInBytes: 1296
PeakNonPagedPoolUsageInBytes: 11704052
Name: rimmptsk.sys, loads: 1, unloads: 0
CurrentPagedPoolAllocations: 0
CurrentNonPagedPoolAllocations: 0
PeakPagedPoolAllocations: 1
PeakNonPagedPoolAllocations: 1
PagedPoolUsageInBytes: 0
NonPagedPoolUsageInBytes: 0
PeakPagedPoolUsageInBytes: 116
PeakNonPagedPoolUsageInBytes: 184
Name: rimsptsk.sys, loads: 1, unloads: 0
CurrentPagedPoolAllocations: 0
CurrentNonPagedPoolAllocations: 0
PeakPagedPoolAllocations: 1
PeakNonPagedPoolAllocations: 1
PagedPoolUsageInBytes: 0
NonPagedPoolUsageInBytes: 0
PeakPagedPoolUsageInBytes: 116
PeakNonPagedPoolUsageInBytes: 148
Name: rixdptsk.sys, loads: 1, unloads: 0
CurrentPagedPoolAllocations: 0
CurrentNonPagedPoolAllocations: 0
PeakPagedPoolAllocations: 1
PeakNonPagedPoolAllocations: 1
PagedPoolUsageInBytes: 0
NonPagedPoolUsageInBytes: 0
PeakPagedPoolUsageInBytes: 112
PeakNonPagedPoolUsageInBytes: 12
Name: vstazl3.sys, loads: 1, unloads: 0
CurrentPagedPoolAllocations: 3
CurrentNonPagedPoolAllocations: 14
PeakPagedPoolAllocations: 6
PeakNonPagedPoolAllocations: 14
PagedPoolUsageInBytes: 200
NonPagedPoolUsageInBytes: 1060
PeakPagedPoolUsageInBytes: 316
PeakNonPagedPoolUsageInBytes: 1060
Name: vstdpv3.sys, loads: 1, unloads: 0
CurrentPagedPoolAllocations: 3
CurrentNonPagedPoolAllocations: 2
PeakPagedPoolAllocations: 6
PeakNonPagedPoolAllocations: 2
PagedPoolUsageInBytes: 236
NonPagedPoolUsageInBytes: 816
PeakPagedPoolUsageInBytes: 400
PeakNonPagedPoolUsageInBytes: 816
Name: vstcnxt3.sys, loads: 1, unloads: 0
CurrentPagedPoolAllocations: 6
CurrentNonPagedPoolAllocations: 0
PeakPagedPoolAllocations: 6
PeakNonPagedPoolAllocations: 1
PagedPoolUsageInBytes: 956
NonPagedPoolUsageInBytes: 0
PeakPagedPoolUsageInBytes: 956
PeakNonPagedPoolUsageInBytes: 16
Name: dump_dumpata.sys, loads: 0, unloads: 0
CurrentPagedPoolAllocations: 0
CurrentNonPagedPoolAllocations: 0
PeakPagedPoolAllocations: 0
PeakNonPagedPoolAllocations: 0
PagedPoolUsageInBytes: 0
NonPagedPoolUsageInBytes: 0
PeakPagedPoolUsageInBytes: 0
PeakNonPagedPoolUsageInBytes: 0
Name: dump_atapi.sys, loads: 2, unloads: 1
CurrentPagedPoolAllocations: 0
CurrentNonPagedPoolAllocations: 0
PeakPagedPoolAllocations: 0
PeakNonPagedPoolAllocations: 0
PagedPoolUsageInBytes: 0
NonPagedPoolUsageInBytes: 0
PeakPagedPoolUsageInBytes: 0
PeakNonPagedPoolUsageInBytes: 0
Name: dump_dumpfve.sys, loads: 2, unloads: 1
CurrentPagedPoolAllocations: 0
CurrentNonPagedPoolAllocations: 1
PeakPagedPoolAllocations: 0
PeakNonPagedPoolAllocations: 1
PagedPoolUsageInBytes: 0
NonPagedPoolUsageInBytes: 16392
PeakPagedPoolUsageInBytes: 0
PeakNonPagedPoolUsageInBytes: 16392
Name: btusbflt.sys, loads: 3, unloads: 2
CurrentPagedPoolAllocations: 1
CurrentNonPagedPoolAllocations: 220
PeakPagedPoolAllocations: 2
PeakNonPagedPoolAllocations: 220
PagedPoolUsageInBytes: 116
NonPagedPoolUsageInBytes: 353260
PeakPagedPoolUsageInBytes: 180
PeakNonPagedPoolUsageInBytes: 353260
Name: secdrv.sys, loads: 1, unloads: 0
CurrentPagedPoolAllocations: 1
CurrentNonPagedPoolAllocations: 0
PeakPagedPoolAllocations: 3
PeakNonPagedPoolAllocations: 0
PagedPoolUsageInBytes: 36
NonPagedPoolUsageInBytes: 0
PeakPagedPoolUsageInBytes: 280
PeakNonPagedPoolUsageInBytes: 0
Name: netwlv32.sys, loads: 1, unloads: 0
CurrentPagedPoolAllocations: 0
CurrentNonPagedPoolAllocations: 1790
PeakPagedPoolAllocations: 0
PeakNonPagedPoolAllocations: 1854
PagedPoolUsageInBytes: 0
NonPagedPoolUsageInBytes: 647068
PeakPagedPoolUsageInBytes: 0
PeakNonPagedPoolUsageInBytes: 708972
C:\Windows\system32>
My System SpecsSystem Spec
25 May 2011   #7

Windows 7 Ultimate 32bit
 
 
cbs log

hi again,
i also attach the CBS.log; it noted
Windows Resource Protection found corrupt files but was unable to fix some of them.
can you advise what these files are in the log which is zipped and attached?
thanks again
john
My System SpecsSystem Spec
26 May 2011   #8

Windows 7 Ultimate 32bit
 
 

hi, can anyone assist with the problems reported above? my laptop has just now taken 7 attempts to start up...
thanks
john
My System SpecsSystem Spec
26 May 2011   #9

Microsoft Community Contributor Award Recipient

Windows 7 Home Premium 64bit
 
 

The files that could not be repaired are part of your Intel Network drivers.

DV = driver verifier. When you enable driver verifier it stresses the drivers and it will cause faulty drivers to crash and cause a blue screen.

Which Prime95 test did you run? There are three of them (Small FFTs, Large FFTs, and Blend) If you only ran one of the three, run the other two and let me know what happens
My System SpecsSystem Spec
27 May 2011   #10

Windows 7 Ultimate 32bit
 
 

after running the three prime95 tests only the one i reported here earlier gave a fail.
can i / should i find and remove the intel faulty drivers?d what should i do
the machine is now crashing a lot; is this to do with the DV = driver verifier and if so what should i do now?

thanks
My System SpecsSystem Spec
Reply

 bsod win7 32bit dell vistro1500 FREQUENT CRASHES





Thread Tools



Similar help and support threads for2: bsod win7 32bit dell vistro1500 FREQUENT CRASHES
Thread Forum
Frequent BSOD and crashes BSOD Help and Support
Frequent BSOD Dell Inspiron 1545 BSOD Help and Support
Frequent Random Crashes Win7 X64- Very frustrating BSOD Help and Support
BSOD and frequent app crashes BSOD Help and Support
frequent crashes with BSOD can you help? BSOD Help and Support
Win7 frequent crashes BSOD Help and Support
IE8 32Bit crashes everytime I open it on Win7 64Bit OS Browsers & Mail

Our Sites

Site Links

About Us

Find Us

Windows 7 Forums is an independent web site and has not been authorized, sponsored, or otherwise approved by Microsoft Corporation. "Windows 7" and related materials are trademarks of Microsoft Corp.

й Designer Media Ltd

All times are GMT -5. The time now is 09:55 PM.
Twitter Facebook Google+



Windows 7 Forums

Seven Forums Android App Seven Forums IOS App
  

1 2 3 4 5 6 7 8 9 10 11 12 13 14 15 16 17 18 19 20 21 22 23 24 25 26 27 28 29 30 31 32 33